چفته تخت
preferred label: flat arch @en
type: Concept
narrower: چفته هره‌چین

چفته هره‌چین
scope note: چَفتۀ تختی که آجرهای آن قائم چیده شده باشد.
broader: چفته تخت
preferred label: soldier arch @en
type: Concept