بوم‌شناسی
preferred label: ecology @en
type: Concept
narrower: بوم‌شناسی سطحی‌نگر

بوم‌شناسی سطحی‌نگر
scope note: جهان‌بینی یا مجموعه‌ای از باورهای مبتنی بر ماده‌گرایی و مصرف‌گرایی که بر سودگرایی و بینش انسان‌محور به طبیعت تأکید دارد.
broader: بوم‌شناسی
preferred label: shallow ecology @en
type: Concept