پست توزیع
scope note: پست برقی متصل به سامانۀ توزیع (distribution system) و تغذیه‌گرهای اولیه (primary feeder) برای تأمین بار تجاری و صنعتی و مسکونی
narrower: پست سر تیر
broader: پست برق
preferred label: distribution substation @en
type: Concept

پست برق
preferred label: electric substation @en
type: Concept
narrower: پست توزیع

پست سر تیر
preferred label: pole-mounted substation @en
type: Concept
broader: پست توزیع