پست افزایندۀ ولتاژ
scope note: پست مبدل ولتاژی که ولتاژ خروجی آن بالاتر از ولتاژ ورودی آن است.
broader: پست مبدل ولتاژ
preferred label: step-up substation @en
type: Concept

پست مبدل ولتاژ
preferred label: transformer substation @en
type: Concept
narrower: پست افزایندۀ ولتاژ