پست برق
preferred label: electric substation @en
type: Concept
narrower: پست بی‌کارور

پست بی‌کارور
scope note: پست برقی که از بیرون و به‌وسیلۀ کارکنانی که در آن حضور ندارند واپایش می‌شود.
narrower: پست دورفرمان
broader: پست برق
preferred label: unmanned substation @en
type: Concept

پست دورفرمان
preferred label: remotely controlled substation @en
type: Concept
broader: پست بی‌کارور