مهندسی فراوری غذا
scope note: استفاده از خصوصیات مواد غذایی برای طراحی و ساخت تجهیزات و فراوری محصولات غذایی
broader: مهندسی
preferred label: food process engineering @en
type: Concept

مهندسی
preferred label: engineering @en
type: Concept
narrower: مهندسی فراوری غذا