ترمز دوگانه
scope note: ترمزی ویژۀ برخی واگن‌های باری که براساس پر یا خالی بودن واگن دو نوع ترمزگیری را امکان‌پذیر می‌سازد.
broader: ترمز
preferred label: empty/load brake @en
type: Concept

ترمز
preferred label: brake @en
type: Concept
narrower: ترمز دوگانه