مشعل سوختی
preferred label: fuel burner @en
type: Concept
narrower: مشعل پس‌سوز

مشعل پس‌سوز
scope note: مشعل نصب‌شده در اتاقک احتراق ثانویۀ زباله‌سوز برای حفظ کمینۀ دما و احتراق کامل گازهای نسوخته
broader: مشعل سوختی
preferred label: secondary burner @en
type: Concept