تأسیسات درهم‌سوزانی
scope note: نوعی زباله‌سوز که در آن پسماندها را بدون جداسازی یا فراوری برای بازیافت می‌سوزانند.
broader: زباله‌سوز
preferred label: mass burn facility @en
type: Concept

زباله‌سوز
preferred label: refuse incinerator @en
type: Concept
narrower: تأسیسات درهم‌سوزانی