سوخت فسیلی
preferred label: fossil fuel @en
type: Concept
related: کوره بازتابی

کوره بازتابی
scope note: کوره‌ای با سوخت فسیلی که سقف کوتاه آن شعله و حرارت را به سطح بار کوره می‌تاباند.
related: سوخت فسیلی
broader: کوره
preferred label: reverberatory furnace @en
type: Concept

کوره
preferred label: furnace @en
type: Concept
narrower: کوره بازتابی