شیر برچین
scope note: شیری در موتورهای توربین گازی که خروج هوا را ممکن می‌سازد.
related: توربین گازی
broader: سوپاپ
preferred label: bleed valve @en
type: Concept

توربین گازی
preferred label: gas turbine @en
type: Concept
related: شیر برچین

سوپاپ
preferred label: valve (mechanical) @en
type: Concept
narrower: شیر برچین