موتور خودرو
preferred label: automobile engine @en
type: Concept
related: دریچه برگشت دود

دریچه برگشت دود
scope note: دریچه‌ای که برگشت دود را به جریان ورودی مخلوط هوا و سوخت امکان‌پذیر می‌سازد.
related: موتور خودرو
broader: سوپاپ
preferred label: exhaust gas recirculation valve @en
type: Concept

سوپاپ
preferred label: valve (mechanical) @en
type: Concept
narrower: دریچه برگشت دود