دریچه گرمکن هوای ورودی
scope note: دریچه‌ای که بخشی از دود حاصل از احتراق را برای گرم کردن مخلوط سوخت و هوا به اطراف چندراهۀ هوا هدایت می‌کند و با دماپا یا خلأ ناشی از جریان یا رایانه تنظیم‌پذیر است.
related: موتور خودرو
broader: سوپاپ
preferred label: exhaust heat control valve @en
type: Concept

موتور خودرو
preferred label: automobile engine @en
type: Concept
related: دریچه گرمکن هوای ورودی

سوپاپ
preferred label: valve (mechanical) @en
type: Concept
narrower: دریچه گرمکن هوای ورودی