سیلندر موتور
preferred label: engine cylinder @en
type: Concept
related: سوپاپ دود

سوپاپ دود
scope note: سوپاپی که با باز شدن آن دود حاصل از احتراق از سیلندرها خارج می‌شود.
related: سیلندر موتور
broader: سوپاپ
preferred label: exhaust valve @en
type: Concept

سوپاپ
preferred label: valve (mechanical) @en
type: Concept
narrower: سوپاپ دود