شیر توزین
scope note: نوعی شیر که از آن برای توزین بار وسیلۀ نقلیۀ ریلی استفاده می‌شود.
related: واگن باری
broader: سوپاپ
preferred label: weighing valve @en
type: Concept

واگن باری
preferred label: freight car @en
type: Concept
related: شیر توزین

سوپاپ
preferred label: valve (mechanical) @en
type: Concept
narrower: شیر توزین