صنعت بانکداری
preferred label: Banking industry @en
type: Concept
narrower: بانکداری الکترونیکی

بانکداری الکترونیکی
scope note: نوعی بانکداری که در آن مشتری تراکنش خود را ازطریق شبکۀ اینترنت انجام می‌دهد.
broader: صنعت بانکداری
preferred label: electronic banking @en
type: Concept