ریل‌بر
preferred label: rail saw @en
type: Concept
narrower: ریل‌بر ثابت

ریل‌بر ثابت
scope note: ریل‌بُری که در یک کارگاه ثابت، که ریل‌ها در آنجا برش داده می‌شوند، مستقر است.
broader: ریل‌بر
preferred label: stationary rail saw @en
type: Concept