نمایشگر بالا
scope note: صفحۀ نشان‌دهنده اطلاعات پرواز و ناوبری و تهاجم یا سایر اطلاعاتی که در میدان دید خلبان قرار دارد.
broader: افزاره نمایش
preferred label: head-up display @en
type: Concept

افزاره نمایش
preferred label: display device @en
type: Concept
narrower: نمایشگر بالا