بافه حفاظ‌دار
alternative label: کابل حفاظ‌دار
scope note: بافه‌ای که رساناهای درون آن دارای پوشش‌اند.
broader: بافه الکتریکی
preferred label: shield cable @en
type: Concept

بافه الکتریکی
preferred label: electric cable @en
type: Concept
narrower: بافه حفاظ‌دار