اتصال‌دهنده الکتریکی
preferred label: electric connector @en
type: Concept
narrower: اتصال‌دهنده ماده

اتصال‌دهنده ماده
scope note: اتصال‌دهنده‌ای که اتصال‌های آن درون حفره‌ای تعبیه شده است و اتصال‌دهندۀ نر به درون این حفره فرومی‌رود و اتصال‌هایشان به هم وصل می‌شود؛ هدف از این سازوکار، ایجاد اتصال الکتریکی محکم و مطلوب بین اتصال‌دهندۀ نر و ماده است.
broader: اتصال‌دهنده الکتریکی
preferred label: female connector @en
type: Concept