وارونگر رهبندی
scope note: مداری که رهبندی ورودی آن در هنگام اتصال به بار با وارون رهبندی آن متناظر باشد.
narrower: وارونگر رهبندی منفی
broader: وارونگر الکتریکی
preferred label: impedance inverter @en
type: Concept

وارونگر رهبندی منفی
preferred label: negative impedance converter @en
type: Concept
broader: وارونگر رهبندی

وارونگر الکتریکی
preferred label: electric inverter @en
type: Concept
narrower: وارونگر رهبندی