فروگردان
scope note: افزاره‌ای که بسامدی را به بسامد پایین‌تر تبدیل می‌کند.
broader: واگردان بسامد
preferred label: down-converter @en
type: Concept

واگردان بسامد
preferred label: frequency converter @en
type: Concept
narrower: فروگردان