چراغ جلو
preferred label: headlight @en
type: Concept
narrower: چراغ نوربالا

چراغ نوربالا
scope note: در چراغ جلوهای دوقلو چراغی که در کاسه‌چراغ درونی نصب شده است و از آن برای وسعت دید بیشتر راننده در شب استفاده می‌شود.
broader: چراغ جلو
preferred label: inner headlight @en
type: Concept