پایانه رایانه
preferred label: computer terminal @en
type: Concept
narrower: پایانه هوشمند

پایانه هوشمند
scope note: پایانه‌ای با قدرت کامل پردازش که مستقل از رایانۀ مرکزی است.
broader: پایانه رایانه
preferred label: intelligent terminal @en
type: Concept