چاپگر (رایانه)
preferred label: printer (computer) @en
type: Concept
narrower: چاپگر سطری

چاپگر سطری
scope note: چاپگری که در آن اطلاعات یک سطر یکجا چاپ شود.
broader: چاپگر (رایانه)
preferred label: line printer @en
type: Concept