چاپگر اپتیکی
scope note: دستگاهی برای چاپ فیلم یا جلوه‌های ویژه با استفاده از ابزارهای نوری/ اپتیکی
broader: چاپگر (رایانه)
preferred label: optical printer @en
type: Concept

چاپگر (رایانه)
preferred label: printer (computer) @en
type: Concept
narrower: چاپگر اپتیکی