رایانه کوچک
preferred label: minicomputer @en
type: Concept
narrower: رایانه جیبی

رایانه جیبی
scope note: رایانه‌ای کوچک و قابلِ‌حمل در ابعادی که می‌توان آن را با یک دست نگه داشت و با دست دیگر از آن استفاده کرد یا در جیب گذاشت.
broader: رایانه کوچک
preferred label: pocket computer @en
type: Concept