الکترود کمکی
scope note: الکترودی که جریان را به الکترود مورد آزمایش منتقل می‌کند.
broader: الکترود
preferred label: auxiliary electrode @en
type: Concept

الکترود
preferred label: electrode @en
type: Concept
narrower: الکترود کمکی