افزاره میسفت
alternative label: ترانزیستور اثرمیدانی نیم‌رسانای عایق فلزی
scope note: ترانزیستور اثر میدانی نیم رسانای عایق فلزی
broader: ترانزیستور اثرمیدانی
preferred label: MISFET device @en
type: Concept

ترانزیستور اثرمیدانی
preferred label: field effect transistor @en
type: Concept
narrower: افزاره میسفت