زی‌مایه
preferred label: enzyme @en
type: Concept
related: حسگر زی‌تجزیه‌ای

زی‌حسگر
preferred label: biosensor @en
type: Concept
narrower: حسگر زی‌تجزیه‌ای

حسگر زی‌تجزیه‌ای
scope note: زی‌حسگری که گیرندۀ زیست‌شیمیایی آن از مواد زیستی نظیر زی‌مایه‌ها و ریزاندامگان‌ها تشکیل شده است‌.
related: زی‌مایه
broader: زی‌حسگر
preferred label: bioanalytical sensor @en
type: Concept