حسگر دمای هوای ورودی
alternative label: حسگر دمای ورودی
scope note: حسگری در مسیر هوای ورودی به موتور که نوسانات دمایی را تبدیل به نشانک الکتریکی می‌کند.
related: موتور
broader: حسگر
preferred label: intake air temperature sensor @en
type: Concept

موتور
preferred label: motor @en
type: Concept
related: حسگر دمای هوای ورودی

حسگر
preferred label: sensor @en
type: Concept
narrower: حسگر دمای هوای ورودی