بادسنج
preferred label: anemometer @en
type: Concept
narrower: بادسنج صوتی

بادسنج صوتی
scope note: بادسنجی که به‌کمک خواص امواج صوتی بادبُرد (wind-borne) سرعت باد را می‌سنجد.
broader: بادسنج
preferred label: sonic anemometer @en
type: Concept