رهبندی‌سنج
preferred label: impedance meter @en
type: Concept
related: مغناطیس‌سنج رهبندی

مغناطیس‌سنج
preferred label: magnetometer @en
type: Concept
narrower: مغناطیس‌سنج رهبندی

مغناطیس‌سنج رهبندی
scope note: ابزاری برای محاسبۀ تغییرات میدان مغناطیسی بر مبنای سنجش میزان تغییر در رهبندی
related: رهبندی‌سنج
broader: مغناطیس‌سنج
preferred label: impedance magnetometer @en
type: Concept