مغناطیس‌سنج نوردمشی
scope note: نوعی مغناطیس‌سنج که شدت میدان مغناطیسی کلی را با استفاده از بسامد تقدیمی اتم‌های مغناطیسی در حالت گازی اندازه‌گیری می‌کند.
broader: مغناطیس‌سنج
preferred label: optically pumped magnetometer @en
type: Concept

مغناطیس‌سنج
preferred label: magnetometer @en
type: Concept
narrower: مغناطیس‌سنج نوردمشی