فشارسنج هوا
preferred label: barometer @en
type: Concept
narrower: فشارسنج وزنی

فشارسنج وزنی
scope note: فشارسنجی جیوه‌ای که فشار جوّ را با وزن کردن جیوه در ستون شیشه‌ای یا کیسه‌ای ثبت می‌کند.
broader: فشارسنج هوا
preferred label: weight barometer @en
type: Concept