نم‌سنج مویی
scope note: نم‌سنجی برای اندازه‌گیری رطوبت نسبی براساس تغییرات طول تار مو
broader: نم‌سنج
preferred label: hair hygrometer @en
type: Concept

نم‌سنج
preferred label: hygrometer @en
type: Concept
narrower: نم‌سنج مویی