اتاقک یونش
preferred label: ionization chamber @en
type: Concept
related: شمارگر تناسبی

شمارگر تناسبی
scope note: وسیله‌ای که در ناحیۀ تناسبی کار می‌کند تا رویدادهای تابشی، به‌ویژه ذرات α و β و پرتوهای ایکس را شمارش کند.
related: اتاقک یونش
broader: تابش‌شمار
preferred label: proportional counter @en
type: Concept

تابش‌شمار
preferred label: radiation counter @en
type: Concept
narrower: شمارگر تناسبی