دوربین عکاسی
preferred label: camera @en
type: Concept
narrower: دوربین زمینی

دوربین زمینی
scope note: دوربینی که برای عکس‌برداری از روی زمین طراحی شده است.
broader: دوربین عکاسی
preferred label: terrestrial camera @en
type: Concept