تلسکوپ سمت‌ارتفاعی
scope note: تلسکوپی که محور اصلی آن در جهت سمت‌الرأس تنظیم شده ‌است.
broader: تلسکوپ
preferred label: altazimuth telescope @en
type: Concept

تلسکوپ
preferred label: telescope @en
type: Concept
narrower: تلسکوپ سمت‌ارتفاعی