تلسکوپ فرابنفش
scope note: تلسکوپی که برای رصد در بازۀ طیفی فرابنفش طراحی شده‌ است.
broader: تلسکوپ
preferred label: ultraviolet telescope @en
type: Concept

تلسکوپ
preferred label: telescope @en
type: Concept
narrower: تلسکوپ فرابنفش