گران‌روی‌سنج چرخک‌پیاله‌ای
scope note: وعی گران‌رَوی‌سنج که دارای یک قطعۀ چرخان پیستون‌مانند و یک کاسۀ پر از مایع است که از آن برای اندازه‌گیری گران‌رَوی مایعات ریختنی، دوغاب‌ها، نَرماسُل‌ها و محلول‌ها استفاده می‌شود و در آن گشتاور چرخش ملاک اندازه‌گیری گران‌رَوی است.
broader: گران‌روی‌سنج
preferred label: cup-and-bob viscometer @en
type: Concept

گران‌روی‌سنج
preferred label: viscometer @en
type: Concept
narrower: گران‌روی‌سنج چرخک‌پیاله‌ای