جرثقیل
preferred label: crane @en
type: Concept
narrower: جرثقیل سیار

جرثقیل سیار
scope note: هر جرثقیلی که قابل جابه‌جا شدن از مکانی به مکان دیگر باشد.
broader: جرثقیل
preferred label: mobile crane @en
type: Concept