مهمات زیستی
scope note: مهماتی که در آن عمدتاً از عوامل زیستی استفاده می‌شود.
broader: مهمات
preferred label: biological ammunitions @en
type: Concept

مهمات
preferred label: ammunitions @en
type: Concept
narrower: مهمات زیستی