بمب ناپالم
scope note: بمبی محتوی نوعی ترکیب مایع، ترجیحاً بنزین با اکتان 80 و یکی از پودرهای ام 1 یا ام 2 یا ام 9، که پس از پرتاب و برخورد به هدف، مادۀ ژلاتینی تولید می‌کند و با شعله و حرارت زیاد می‌سوزد.
broader: بمب (تسلیحات)
preferred label: napalm bomb @en
type: Concept

بمب (تسلیحات)
preferred label: bomb (ordnance) @en
type: Concept
narrower: بمب ناپالم