بمب چتردار
scope note: بمبی با تجهیزات ویژه و چتری که پس از پرتاب از هواگرد به‌طور خودکار باز می‌شود.
broader: بمب (تسلیحات)
preferred label: para bomb @en
type: Concept

بمب (تسلیحات)
preferred label: bomb (ordnance) @en
type: Concept
narrower: بمب چتردار