بمب (تسلیحات)
preferred label: bomb (ordnance) @en
type: Concept
narrower: بمب درخشی

عکاسی نظامی
preferred label: military photography @en
type: Concept
related: بمب درخشی

بمب درخشی
scope note: مواد آتش‌زایی که از هواگرد پرتاب می‌شود و با ایجاد نور زیاد امکان عکس‌برداری در شب را فراهم می‌سازد.
related: عکاسی نظامی
broader: بمب (تسلیحات)
preferred label: photoflash bomb @en
type: Concept