بمب (تسلیحات)
preferred label: bomb (ordnance) @en
type: Concept
narrower: بمب ساعتی

بمب ساعتی
scope note: مبی که براثر اتصال به یک مدار الکتریکی، با ایجاد جرقه ازطریق چاشنی، مواد منفجرۀ داخلی آن در زمان معینی منفجر می‌شود.
broader: بمب (تسلیحات)
preferred label: time bomb @en
type: Concept