موشک ضدرادار سریع
scope note: نوعی موشک ضدرادار با سرعت زیاد که برای استفاده علیه رادارهای اخطار اولیه و سامانه‌های پدافند هوایی به کار می‌رود.
broader: موشک ضدرادار
preferred label: high-speed anti-radiation missile @en
type: Concept

موشک ضدرادار
preferred label: anti-radiation missile @en
type: Concept
narrower: موشک ضدرادار سریع