موشک رخنه‌گر
scope note: موشکی با فیوز تأخیری و کلاهک ویژه که برای تخریب اهداف پنهان در زمین به کار می‌رود و پس از نفوذ تا عمق معینی منفجر می‌شود.
broader: موشک هدایت‌شونده
preferred label: penetrating missile @en
type: Concept

موشک هدایت‌شونده
preferred label: missile @en
type: Concept
narrower: موشک رخنه‌گر