آینه
preferred label: mirror @en
type: Concept
related: باریکه‌شکاف

باریکه‌شکاف
scope note: ابزاری اپتیکی برای شکافتن باریکۀ نور در امتداد دو یا چند مسیر
related: آینه
broader: افزاره نوری
preferred label: beam splitter @en
type: Concept

افزاره نوری
preferred label: optical device @en
type: Concept
narrower: باریکه‌شکاف